BDBM50031080 3-(4-Fluoro-phenyl)-5-iodo-2-(4-methanesulfonyl-phenyl)-1H-pyrrole::CHEMBL127120
SMILES CS(=O)(=O)c1ccc(cc1)-c1[nH]c(I)cc1-c1ccc(F)cc1
InChI Key InChIKey=OQCWBVYFVMDDHP-UHFFFAOYSA-N
Data  2 IC50
  Tab Delimited (TSV)   2D SDfile   Computed 3D by Vconf -m prep SDfile
Find this compound or compounds like it in BindingDB:
Activity Spreadsheet -- Enzyme Inhibition Constant Data from BindingDB
Found 2 hits for monomerid = 50031080
TargetProstaglandin G/H synthase 2(Homo sapiens (Human))
Dupont Pharmaceuticals
Curated by ChEMBL
LigandPNGBDBM50031080(3-(4-Fluoro-phenyl)-5-iodo-2-(4-methanesulfonyl-ph...)
Affinity DataIC50:  9.23E+4nM. Assay description: Tested for inhibitory activity against Prostaglandin G/H synthase 2 from human
In DepthDetails ArticlePubMed
TargetProstaglandin G/H synthase 1(Ovis aries (Sheep))
Dupont Pharmaceuticals
Curated by ChEMBL
LigandPNGBDBM50031080(3-(4-Fluoro-phenyl)-5-iodo-2-(4-methanesulfonyl-ph...)
Affinity DataIC50: >3.00E+5nM. Assay description: Tested for inhibitory activity against Prostaglandin G/H synthase 1 from ovine
In DepthDetails ArticlePubMed