BDBM50031097 4-(4-Fluoro-phenyl)-5-(4-methanesulfonyl-phenyl)-1H-pyrrole-2-carbonitrile::CHEMBL419777
SMILES CS(=O)(=O)c1ccc(cc1)-c1[nH]c(cc1-c1ccc(F)cc1)C#N
InChI Key InChIKey=GVPJNBGMXCNMDH-UHFFFAOYSA-N
Data  1 IC50
  Tab Delimited (TSV)   2D SDfile   Computed 3D by Vconf -m prep SDfile
Find this compound or compounds like it in BindingDB:
Activity Spreadsheet -- Enzyme Inhibition Constant Data from BindingDB
Found 1 hit for monomerid = 50031097
TargetProstaglandin G/H synthase 2(Homo sapiens (Human))
Dupont Pharmaceuticals
Curated by ChEMBL
LigandPNGBDBM50031097(4-(4-Fluoro-phenyl)-5-(4-methanesulfonyl-phenyl)-1...)
Affinity DataIC50:  6.44E+4nM. Assay description: Tested for inhibitory activity against Prostaglandin G/H synthase 2 from human
In DepthDetails ArticlePubMed