BDBM50031211 (S)-1-{(S)-2-[4-(4-Chloro-benzenesulfonylaminocarbonyl)-benzoylamino]-3-methyl-butyryl}-pyrrolidine-2-carboxylic acid [(S)-1-(5-methoxy-benzooxazole-2-carbonyl)-2-methyl-propyl]-amide::CHEMBL337968
SMILES COc1ccc2oc(nc2c1)C(=O)[C@@H](NC(=O)[C@@H]1CCCN1C(=O)[C@@H](NC(=O)c1ccc(cc1)C(=O)NS(=O)(=O)c1ccc(Cl)cc1)C(C)C)C(C)C
InChI Key InChIKey=OYIYFONSENFXBY-ASVWTAOFSA-N
Data  1 KI
  Tab Delimited (TSV)   2D SDfile   Computed 3D by Vconf -m prep SDfile
Find this compound or compounds like it in BindingDB:
Activity Spreadsheet -- Enzyme Inhibition Constant Data from BindingDB
Found 1 hit for monomerid = 50031211
TargetNeutrophil elastase(Homo sapiens (Human))
Zeneca Pharmaceuticals
Curated by ChEMBL
LigandPNGBDBM50031211((S)-1-{(S)-2-[4-(4-Chloro-benzenesulfonylaminocarb...)
Affinity DataKi:  0.660nM. Assay description: Inhibition of human neutrophil elastase-catalyzed hydrolysis of the synthetic substrate MeO-Suc-Ala-Ala-Pro-Val-pNa
In DepthDetails ArticlePubMed