BDBM50031774 (R)-2-(5-(benzyloxy)pentyl)-N4-hydroxy-N1-((S)-1-(methylamino)-1-oxo-3-phenylpropan-2-yl)succinamide::(R)-2-(5-Benzyloxy-pentyl)-N*4*-hydroxy-N*1*-((S)-1-methylcarbamoyl-2-phenyl-ethyl)-succinamide::CHEMBL85806
SMILES CNC(=O)[C@H](Cc1ccccc1)NC(=O)[C@H](CCCCCOCc1ccccc1)CC(=O)NO
InChI Key InChIKey=QSONFBZTWRVCKO-PKTZIBPZSA-N
Data  4 KI
  Tab Delimited (TSV)   2D SDfile   Computed 3D by Vconf -m prep SDfile
Find this compound or compounds like it in BindingDB:
Activity Spreadsheet -- Enzyme Inhibition Constant Data from BindingDB
Found 4 hits for monomerid = 50031774
TargetNeutrophil collagenase(Homo sapiens (Human))
Sterling Winthrop Pharmaceuticals Research Division
Curated by ChEMBL
LigandPNGBDBM50031774((R)-2-(5-(benzyloxy)pentyl)-N4-hydroxy-N1-((S)-1-(...)
Affinity DataKi:  2nM. Assay description: Inhibition of human neutrophil collagenase(HNC), MMP-8
In DepthDetails ArticlePubMed
TargetStromelysin-1(Homo sapiens (Human))
Sterling Winthrop Pharmaceuticals Research Division
Curated by ChEMBL
LigandPNGBDBM50031774((R)-2-(5-(benzyloxy)pentyl)-N4-hydroxy-N1-((S)-1-(...)
Affinity DataKi:  19nM. Assay description: Inhibitory potency against human stromelysin, MMP-3
In DepthDetails ArticlePubMed
TargetStromelysin-1(Homo sapiens (Human))
Sterling Winthrop Pharmaceuticals Research Division
Curated by ChEMBL
LigandPNGBDBM50031774((R)-2-(5-(benzyloxy)pentyl)-N4-hydroxy-N1-((S)-1-(...)
Affinity DataKi:  19nM. Assay description: Inhibition of MMP3
In DepthDetails ArticlePubMed
TargetInterstitial collagenase(Homo sapiens (Human))
Sterling Winthrop Pharmaceuticals Research Division
Curated by ChEMBL
LigandPNGBDBM50031774((R)-2-(5-(benzyloxy)pentyl)-N4-hydroxy-N1-((S)-1-(...)
Affinity DataKi:  920nM. Assay description: Inhibitory potency against human fibroblast collagenase, MMP-1
In DepthDetails ArticlePubMed