BDBM50031781 3-[(S)-2-((R)-2-Hydroxycarbamoylmethyl-6-phenoxy-hexanoylamino)-3,3-dimethyl-butyrylamino]-propionic acid::CHEMBL313140
SMILES CC(C)(C)[C@H](NC(=O)[C@H](CCCCOc1ccccc1)CC(=O)NO)C(=O)NCCC(O)=O
InChI Key InChIKey=KWXOWVYUSBDBIB-OXQOHEQNSA-N
Data  2 KI
  Tab Delimited (TSV)   2D SDfile   Computed 3D by Vconf -m prep SDfile
Find this compound or compounds like it in BindingDB:
Activity Spreadsheet -- Enzyme Inhibition Constant Data from BindingDB
Found 2 hits for monomerid = 50031781
TargetStromelysin-1(Homo sapiens (Human))
Sterling Winthrop Pharmaceuticals Research Division
Curated by ChEMBL
LigandPNGBDBM50031781(3-[(S)-2-((R)-2-Hydroxycarbamoylmethyl-6-phenoxy-h...)
Affinity DataKi:  3nM. Assay description: Inhibitory potency against human stromelysin, MMP-3
In DepthDetails ArticlePubMed
TargetInterstitial collagenase(Homo sapiens (Human))
Sterling Winthrop Pharmaceuticals Research Division
Curated by ChEMBL
LigandPNGBDBM50031781(3-[(S)-2-((R)-2-Hydroxycarbamoylmethyl-6-phenoxy-h...)
Affinity DataKi:  140nM. Assay description: Inhibitory potency against human fibroblast collagenase, MMP-1
In DepthDetails ArticlePubMed