BDBM50031950 2,6-Dimethyl-4-{[5-oxo-11-(1H-tetrazol-5-yl)-5H-dibenzo[a,d]cyclohepten-3-ylmethyl]-amino}-nicotinic acid ethyl ester::CHEMBL94106
SMILES CCOC(=O)c1c(C)nc(C)cc1NCc1ccc2c(cc3ccccc3c(=O)c2c1)-c1nnn[nH]1
InChI Key InChIKey=LRTRZLGGAOWDNL-UHFFFAOYSA-N
Data  1 KI
  Tab Delimited (TSV)   2D SDfile   Computed 3D by Vconf -m prep SDfile
Find this compound or compounds like it in BindingDB:
Activity Spreadsheet -- Enzyme Inhibition Constant Data from BindingDB
Found 1 hit for monomerid = 50031950
TargetType-1 angiotensin II receptor(Homo sapiens (Human))
Shionogi
Curated by ChEMBL
LigandPNGBDBM50031950(2,6-Dimethyl-4-{[5-oxo-11-(1H-tetrazol-5-yl)-5H-di...)
Affinity DataKi:  2.90nM. Assay description: Ability to displace [125I]-AII binding to COS cells transfected with a cDNA encoding human Angiotensin II receptor, type 1
In DepthDetails ArticlePubMed