BDBM50031952 (S)-3-Methyl-2-{[5-oxo-11-(1H-tetrazol-5-yl)-5H-dibenzo[a,d]cyclohepten-3-ylmethyl]-pentanoyl-amino}-butyric acid::CHEMBL90834
SMILES CCCCC(=O)N(Cc1ccc2c(cc3ccccc3c(=O)c2c1)-c1nnn[nH]1)[C@@H](C(C)C)C(O)=O
InChI Key InChIKey=YYMAPZOOTHITQF-DEOSSOPVSA-N
Data  1 KI
  Tab Delimited (TSV)   2D SDfile   Computed 3D by Vconf -m prep SDfile
Find this compound or compounds like it in BindingDB:
Activity Spreadsheet -- Enzyme Inhibition Constant Data from BindingDB
Found 1 hit for monomerid = 50031952
TargetType-1 angiotensin II receptor(Homo sapiens (Human))
Shionogi
Curated by ChEMBL
LigandPNGBDBM50031952((S)-3-Methyl-2-{[5-oxo-11-(1H-tetrazol-5-yl)-5H-di...)
Affinity DataKi:  8.70nM. Assay description: Ability to displace [125I]-AII binding to COS cells transfected with a cDNA encoding human Angiotensin II receptor, type 1
In DepthDetails ArticlePubMed