BDBM50031959 2-Butyl-5-chloro-3-[5-oxo-11-(1H-tetrazol-5-yl)-5H-dibenzo[a,d]cyclohepten-3-ylmethyl]-3H-imidazole-4-carboxylic acid::CHEMBL327535
SMILES CCCCc1nc(Cl)c(C(O)=O)n1Cc1ccc2c(cc3ccccc3c(=O)c2c1)-c1nnn[nH]1
InChI Key InChIKey=CWRWYPBWBJZCSR-UHFFFAOYSA-N
Data  1 KI
  Tab Delimited (TSV)   2D SDfile   Computed 3D by Vconf -m prep SDfile
Find this compound or compounds like it in BindingDB:
Activity Spreadsheet -- Enzyme Inhibition Constant Data from BindingDB
Found 1 hit for monomerid = 50031959
TargetType-1 angiotensin II receptor(Homo sapiens (Human))
Shionogi
Curated by ChEMBL
LigandPNGBDBM50031959(2-Butyl-5-chloro-3-[5-oxo-11-(1H-tetrazol-5-yl)-5H...)
Affinity DataKi:  2.10nM. Assay description: Ability to displace [125I]-AII binding to COS cells transfected with a cDNA encoding human Angiotensin II receptor, type 1
In DepthDetails ArticlePubMed