BDBM50032105 6-(2-Dimethylamino-ethoxy)-N*2*-(4-fluoro-2-methyl-phenyl)-N*4*-methyl-N*4*-phenyl-quinazoline-2,4-diamine::CHEMBL93343::TCMDC-142333
SMILES CN(C)CCOc1ccc2nc(Nc3ccc(F)cc3C)nc(N(C)c3ccccc3)c2c1
InChI Key InChIKey=HYNMYGBTSOHIHG-UHFFFAOYSA-N
Data  1 IC50
  Tab Delimited (TSV)   2D SDfile   Computed 3D by Vconf -m prep SDfile
Find this compound or compounds like it in BindingDB:
Activity Spreadsheet -- Enzyme Inhibition Constant Data from BindingDB
Found 1 hit for monomerid = 50032105
TargetPotassium-transporting ATPase alpha chain 1/subunit beta(Sus scrofa (Pig))
Smithkline Beecham Pharmaceuticals R&D
Curated by ChEMBL
LigandPNGBDBM50032105(6-(2-Dimethylamino-ethoxy)-N*2*-(4-fluoro-2-methyl...)
Affinity DataIC50:  1.30E+3nM. Assay description: Inhibition of K+ stimulated gastric ATPase activity
In DepthDetails ArticlePubMed