BDBM50032121 CHEMBL92450::N*2*-Benzyl-N*4*-o-tolyl-quinazoline-2,4-diamine::TCMDC-142319
SMILES Cc1ccccc1Nc1nc(NCc2ccccc2)nc2ccccc12
InChI Key InChIKey=IGHURCBLHKYCFM-UHFFFAOYSA-N
Data  1 IC50
  Tab Delimited (TSV)   2D SDfile   Computed 3D by Vconf -m prep SDfile
Find this compound or compounds like it in BindingDB:
Activity Spreadsheet -- Enzyme Inhibition Constant Data from BindingDB
Found 1 hit for monomerid = 50032121
TargetPotassium-transporting ATPase alpha chain 1/subunit beta(Sus scrofa (Pig))
Smithkline Beecham Pharmaceuticals R&D
Curated by ChEMBL
LigandPNGBDBM50032121(CHEMBL92450 | N*2*-Benzyl-N*4*-o-tolyl-quinazoline...)
Affinity DataIC50:  510nM. Assay description: Inhibition of K+ stimulated gastric ATPase activity
In DepthDetails ArticlePubMed