BDBM50032518 (6aR,12bS)-3-Methyl-6-propyl-5,6,6a,7,8,12b-hexahydro-benzo[a]phenanthridine-10,11-diol::CHEMBL318338
SMILES CCCN1Cc2cc(C)ccc2[C@H]2[C@H]1CCc1cc(O)c(O)cc21
InChI Key InChIKey=IFODQCSLFYJCSE-WIYYLYMNSA-N
Data  1 EC50
  Tab Delimited (TSV)   2D SDfile   Computed 3D by Vconf -m prep SDfile
Find this compound or compounds like it in BindingDB:
Activity Spreadsheet -- Enzyme Inhibition Constant Data from BindingDB
Found 1 hit for monomerid = 50032518
TargetAdenylate cyclase type 5(Rattus norvegicus)
Purdue University
Curated by ChEMBL
LigandPNGBDBM50032518((6aR,12bS)-3-Methyl-6-propyl-5,6,6a,7,8,12b-hexahy...)
Affinity DataEC50:  10nM. Assay description: Effective concentration of the compound as Adenylate cyclase activity was measured in rat homogenate
In DepthDetails ArticlePubMed