BDBM50032553 CHEMBL12914::[2-Methyl-1-(2-morpholin-4-yl-ethyl)-1H-indol-3-yl]-m-tolyl-methanone
SMILES Cc1c(C(=O)c2cccc(C)c2)c2ccccc2n1CCN1CCOCC1
InChI Key InChIKey=LLBPAWNWAYOKBO-UHFFFAOYSA-N
Data  2 KI  1 IC50
  Tab Delimited (TSV)   2D SDfile   Computed 3D by Vconf -m prep SDfile
Find this compound or compounds like it in BindingDB:
Activity Spreadsheet -- Enzyme Inhibition Constant Data from BindingDB
Found 3 hits for monomerid = 50032553
TargetCannabinoid receptor 1(Rattus norvegicus (rat))
Sanofi Research Division
Curated by ChEMBL
LigandPNGBDBM50032553(CHEMBL12914 | [2-Methyl-1-(2-morpholin-4-yl-ethyl)...)
Affinity DataKi:  2.09E+6nM. Assay description: Cannabinoid receptor 1 binding affinity by measuring its ability to displace [3H]WIN-55212-2 in rat forebrain membranes
In DepthDetails ArticlePubMed
TargetCannabinoid receptor 1(Rattus norvegicus (rat))
Sanofi Research Division
Curated by ChEMBL
LigandPNGBDBM50032553(CHEMBL12914 | [2-Methyl-1-(2-morpholin-4-yl-ethyl)...)
Affinity DataKi:  2.09E+6nM. Assay description: Binding affinity at cannabinoid receptor 1 using rat brain membranes
In DepthDetails ArticlePubMed
TargetCannabinoid receptor 1(Rattus norvegicus (rat))
Sanofi Research Division
Curated by ChEMBL
LigandPNGBDBM50032553(CHEMBL12914 | [2-Methyl-1-(2-morpholin-4-yl-ethyl)...)
Affinity DataIC50:  606nM. Assay description: Concentration of compound required to inhibit 50% of [3H]-WIN- 55212 binding to Cannabinoid receptor 1 in rat cerebellum membranes.
In DepthDetails ArticlePubMed