BDBM50032639 (6-Methoxy-1,2,3,4-tetrahydro-naphthalen-2-yl)-dipropyl-amine::CHEMBL106047
SMILES CCCN(CCC)C1CCc2cc(OC)ccc2C1
InChI Key InChIKey=SMAYDEMZELAUEB-UHFFFAOYSA-N
Data  3 KI
  Tab Delimited (TSV)   2D SDfile   Computed 3D by Vconf -m prep SDfile
Find this compound or compounds like it in BindingDB:
Activity Spreadsheet -- Enzyme Inhibition Constant Data from BindingDB
Found 3 hits for monomerid = 50032639
TargetD(3) dopamine receptor(Homo sapiens (Human))
Warner-Lambert
Curated by ChEMBL
LigandPNGBDBM50032639((6-Methoxy-1,2,3,4-tetrahydro-naphthalen-2-yl)-dip...)
Affinity DataKi:  366nM. Assay description: In vitro binding affinity of the compound is the ability to displace [3H]-spiperone from human Dopamine receptor D3 expressed in CHO-K1 cells.
In DepthDetails ArticlePubMed
TargetD(2) dopamine receptor(Homo sapiens (Human))
Warner-Lambert
Curated by ChEMBL
LigandPNGBDBM50032639((6-Methoxy-1,2,3,4-tetrahydro-naphthalen-2-yl)-dip...)
Affinity DataKi:  3.94E+3nM. Assay description: In vitro binding affinity of the compound is the ability to displace [3H]-spiperone from human Dopamine receptor D2 expressed in CHO-K1 cells
In DepthDetails ArticlePubMed
TargetD(2) dopamine receptor(Homo sapiens (Human))
Warner-Lambert
Curated by ChEMBL
LigandPNGBDBM50032639((6-Methoxy-1,2,3,4-tetrahydro-naphthalen-2-yl)-dip...)
Affinity DataKi: >1.00E+4nM. Assay description: In vitro binding affinity of the compound is the ability to displace [3H]-spiperone from human Dopamine receptor D2 expressed in CHO-K1 cells
In DepthDetails ArticlePubMed