BDBM500328 US11021478, Example 9::US11655249, Example 9
SMILES COC(=O)CNC(=O)C1=C(O)C2(CCCC2)n2cccc2C1=O
InChI Key InChIKey=RWCCWZIWQXTOJF-UHFFFAOYSA-N
Data  2 IC50
  Tab Delimited (TSV)   2D SDfile   Computed 3D by Vconf -m prep SDfile
Find this compound or compounds like it in BindingDB:
Activity Spreadsheet -- Enzyme Inhibition Constant Data from BindingDB
Found 2 hits for monomerid = 500328
TargetEgl nine homolog 1(Homo sapiens (Human))
Kind Pharmaceutical
US Patent
LigandPNGBDBM500328(US11021478, Example 9 | US11655249, Example 9)
Affinity DataIC50: >1.00E+4nM. Assay description: 1. Effect of Compounds on Activities of HIF Prolyl Hydroxylase-2 Activities of HIF prolyl hydroxylase was determined according to the method as descr...
Ligand InfoPC cidPC sid
In DepthDetails US Patent
TargetEgl nine homolog 1(Homo sapiens (Human))
Kind Pharmaceutical
US Patent
LigandPNGBDBM500328(US11021478, Example 9 | US11655249, Example 9)
Affinity DataIC50: >1.00E+4nM. Assay description: Activities of HIF prolyl hydroxylase was determined according to the method as described in Anal Biochem, 2004, 330: 74-80, which was slightly modifi...
Ligand InfoPC cidPC sid
In DepthDetails US Patent