BDBM50032972 (3-Amino-propyl)-ethyl-phosphinic acid::CGP-36216::CHEMBL325921
SMILES CCP(O)(=O)CCCN
InChI Key InChIKey=RWCIPYZWXPUGRM-UHFFFAOYSA-N
Data  4 IC50
  Tab Delimited (TSV)   2D SDfile   Computed 3D by Vconf -m prep SDfile
Find this compound or compounds like it in BindingDB:
Activity Spreadsheet -- Enzyme Inhibition Constant Data from BindingDB
Found 4 hits for monomerid = 50032972
TargetGamma-aminobutyric acid type B receptor subunit 1/2(Homo sapiens (Human))
Ciba-Geigy
Curated by ChEMBL
LigandPNGBDBM50032972((3-Amino-propyl)-ethyl-phosphinic acid | CGP-36216...)
Affinity DataIC50:  1.35E+3nM. Assay description: Inhibition of [3H]-baclofen binding to Gamma-aminobutyric acid type B receptor of cat cerebellum
In DepthDetails ArticlePubMed
TargetGamma-aminobutyric acid type B receptor subunit 1/2(Rattus norvegicus (Rat))
TBA
Curated by ChEMBL
LigandPNGBDBM50032972((3-Amino-propyl)-ethyl-phosphinic acid | CGP-36216...)
Affinity DataIC50:  3.00E+3nM. Assay description: In vitro displacement of [3H]-GABA from Gamma-aminobutyric acid type B receptor sites in rat brain membranes
In DepthDetails Article
TargetGamma-aminobutyric acid type B receptor subunit 1(Rattus norvegicus (Rat))
Ciba-Geigy
Curated by ChEMBL
LigandPNGBDBM50032972((3-Amino-propyl)-ethyl-phosphinic acid | CGP-36216...)
Affinity DataIC50:  2.00E+3nM. Assay description: Inhibition of binding of [3H]-CGP-27,492 to gamma-aminobutyric acid type B receptor of rat cortex.
In DepthDetails ArticlePubMed
TargetGamma-aminobutyric acid type B receptor subunit 1/2(Rattus norvegicus (Rat))
TBA
Curated by ChEMBL
LigandPNGBDBM50032972((3-Amino-propyl)-ethyl-phosphinic acid | CGP-36216...)
Affinity DataIC50:  1.98E+3nM. Assay description: Inhibition of [3H]-CGP-27,492 binding to Gamma-aminobutyric acid type B receptor of rat cortex
In DepthDetails ArticlePubMed