BDBM500331 US11021478, Example 16::US11655249, Example 16
SMILES OC(=O)CNC(=O)C1=C(O)C2(CCCC2)n2c(ccc2C1=O)C1CC1
InChI Key InChIKey=FYHAFIDITYJSOV-UHFFFAOYSA-N
Data  2 IC50
  Tab Delimited (TSV)   2D SDfile   Computed 3D by Vconf -m prep SDfile
Find this compound or compounds like it in BindingDB:
Activity Spreadsheet -- Enzyme Inhibition Constant Data from BindingDB
Found 2 hits for monomerid = 500331
TargetEgl nine homolog 1(Homo sapiens (Human))
Kind Pharmaceutical
US Patent
LigandPNGBDBM500331(US11021478, Example 16 | US11655249, Example 16)
Affinity DataIC50:  600nM. Assay description: 1. Effect of Compounds on Activities of HIF Prolyl Hydroxylase-2 Activities of HIF prolyl hydroxylase was determined according to the method as descr...
Ligand InfoPC cidPC sid
In DepthDetails US Patent
TargetEgl nine homolog 1(Homo sapiens (Human))
Kind Pharmaceutical
US Patent
LigandPNGBDBM500331(US11021478, Example 16 | US11655249, Example 16)
Affinity DataIC50:  600nM. Assay description: Activities of HIF prolyl hydroxylase was determined according to the method as described in Anal Biochem, 2004, 330: 74-80, which was slightly modifi...
Ligand InfoPC cidPC sid
In DepthDetails US Patent