BDBM50033140 CHEMBL3356611
SMILES CN1CCN(CC1)c1ccc(cc1)-c1nc2CCCCc2c(NCCN2CCOCC2)n1
InChI Key InChIKey=YFUZUFZJPOKBMN-UHFFFAOYSA-N
Data  1 IC50
  Tab Delimited (TSV)   2D SDfile   Computed 3D by Vconf -m prep SDfile
Find this compound or compounds like it in BindingDB:
Activity Spreadsheet -- Enzyme Inhibition Constant Data from BindingDB
Found 1 hit for monomerid = 50033140
TargetToll-like receptor 9(Homo sapiens (Human))
Sumitomo Dainippon Pharma
Curated by ChEMBL
LigandPNGBDBM50033140(CHEMBL3356611)
Affinity DataIC50:  27nM. Assay description: Antagonist activity at human TLR9 transfected in HEK293 cells after 6 hrs by NF-kappaB luciferase reporter assay
In DepthDetails ArticlePubMed