BDBM50033429 CHEMBL331037::N-[4-(4-{6-[3-(2-Amino-ethyl)-1H-indol-5-yloxy]-hexanoyl}-piperazin-1-yl)-phenyl]-methanesulfonamide
SMILES CS(=O)(=O)Nc1ccc(cc1)N1CCN(CC1)C(=O)CCCCCOc1ccc2[nH]cc(CCN)c2c1
InChI Key InChIKey=AQUSECISJGGKTA-UHFFFAOYSA-N
Data  3 KI
  Tab Delimited (TSV)   2D SDfile   Computed 3D by Vconf -m prep SDfile
Find this compound or compounds like it in BindingDB:
Activity Spreadsheet -- Enzyme Inhibition Constant Data from BindingDB
Found 3 hits for monomerid = 50033429
Target5-hydroxytryptamine receptor 1D(Homo sapiens (Human))
Centre De Recherche Pierre Fabre
Curated by ChEMBL
LigandPNGBDBM50033429(CHEMBL331037 | N-[4-(4-{6-[3-(2-Amino-ethyl)-1H-in...)
Affinity DataKi:  1.30nM. Assay description: Binding affinity to recombinant human 5-hydroxytryptamine 1D receptor alpha
In DepthDetails ArticlePubMed
Target5-hydroxytryptamine receptor 1D(Homo sapiens (Human))
Centre De Recherche Pierre Fabre
Curated by ChEMBL
LigandPNGBDBM50033429(CHEMBL331037 | N-[4-(4-{6-[3-(2-Amino-ethyl)-1H-in...)
Affinity DataKi:  1.40nM. Assay description: Binding affinity for cloned human 5-hydroxytryptamine 1D receptor beta
In DepthDetails ArticlePubMed
Target5-hydroxytryptamine receptor 1A(Homo sapiens (Human))
Centre De Recherche Pierre Fabre
Curated by ChEMBL
LigandPNGBDBM50033429(CHEMBL331037 | N-[4-(4-{6-[3-(2-Amino-ethyl)-1H-in...)
Affinity DataKi:  10nM. Assay description: Binding affinity for cloned human 5-hydroxytryptamine 1A receptor
In DepthDetails ArticlePubMed