BDBM50033433 CHEMBL121901::N-[4-(4-{2-[3-(2-Amino-ethyl)-1H-indol-5-yloxy]-acetyl}-piperazin-1-yl)-phenyl]-methanesulfonamide
SMILES CS(=O)(=O)Nc1ccc(cc1)N1CCN(CC1)C(=O)COc1ccc2[nH]cc(CCN)c2c1
InChI Key InChIKey=GKMNJUKCOSBXMW-UHFFFAOYSA-N
Data  3 KI
  Tab Delimited (TSV)   2D SDfile   Computed 3D by Vconf -m prep SDfile
Find this compound or compounds like it in BindingDB:
Activity Spreadsheet -- Enzyme Inhibition Constant Data from BindingDB
Found 3 hits for monomerid = 50033433
Target5-hydroxytryptamine receptor 1D(Homo sapiens (Human))
Centre De Recherche Pierre Fabre
Curated by ChEMBL
LigandPNGBDBM50033433(CHEMBL121901 | N-[4-(4-{2-[3-(2-Amino-ethyl)-1H-in...)
Affinity DataKi:  0.560nM. Assay description: Binding affinity to recombinant human 5-hydroxytryptamine 1D receptor alpha
In DepthDetails ArticlePubMed
Target5-hydroxytryptamine receptor 1D(Homo sapiens (Human))
Centre De Recherche Pierre Fabre
Curated by ChEMBL
LigandPNGBDBM50033433(CHEMBL121901 | N-[4-(4-{2-[3-(2-Amino-ethyl)-1H-in...)
Affinity DataKi:  2.70nM. Assay description: Binding affinity for cloned human 5-hydroxytryptamine 1D receptor beta
In DepthDetails ArticlePubMed
Target5-hydroxytryptamine receptor 1A(Homo sapiens (Human))
Centre De Recherche Pierre Fabre
Curated by ChEMBL
LigandPNGBDBM50033433(CHEMBL121901 | N-[4-(4-{2-[3-(2-Amino-ethyl)-1H-in...)
Affinity DataKi:  69nM. Assay description: Binding affinity for cloned human 5-hydroxytryptamine 1A receptor
In DepthDetails ArticlePubMed