BDBM50033444 2-[3-(2-Amino-ethyl)-1H-indol-5-yloxy]-1-[4-(4-aminomethyl-phenyl)-piperazin-1-yl]-ethanone::CHEMBL121499
SMILES NCCc1c[nH]c2ccc(OCC(=O)N3CCN(CC3)c3ccc(CN)cc3)cc12
InChI Key InChIKey=XBGNJVHCNNIMKW-UHFFFAOYSA-N
Data  3 KI
  Tab Delimited (TSV)   2D SDfile   Computed 3D by Vconf -m prep SDfile
Find this compound or compounds like it in BindingDB:
Activity Spreadsheet -- Enzyme Inhibition Constant Data from BindingDB
Found 3 hits for monomerid = 50033444
Target5-hydroxytryptamine receptor 1D(Homo sapiens (Human))
Centre De Recherche Pierre Fabre
Curated by ChEMBL
LigandPNGBDBM50033444(2-[3-(2-Amino-ethyl)-1H-indol-5-yloxy]-1-[4-(4-ami...)
Affinity DataKi:  0.930nM. Assay description: Binding affinity to recombinant human 5-hydroxytryptamine 1D receptor alpha
In DepthDetails ArticlePubMed
Target5-hydroxytryptamine receptor 1D(Homo sapiens (Human))
Centre De Recherche Pierre Fabre
Curated by ChEMBL
LigandPNGBDBM50033444(2-[3-(2-Amino-ethyl)-1H-indol-5-yloxy]-1-[4-(4-ami...)
Affinity DataKi:  2.5nM. Assay description: Binding affinity for cloned human 5-hydroxytryptamine 1D receptor beta
In DepthDetails ArticlePubMed
Target5-hydroxytryptamine receptor 1A(Homo sapiens (Human))
Centre De Recherche Pierre Fabre
Curated by ChEMBL
LigandPNGBDBM50033444(2-[3-(2-Amino-ethyl)-1H-indol-5-yloxy]-1-[4-(4-ami...)
Affinity DataKi:  130nM. Assay description: Binding affinity for cloned human 5-hydroxytryptamine 1A receptor
In DepthDetails ArticlePubMed