BDBM50033503 5-Phenethylamino-5,6,7,8-tetrahydro-1H-quinolin-2-one::CHEMBL332647
SMILES O=c1ccc2C(CCCc2[nH]1)NCCc1ccccc1
InChI Key InChIKey=NBNMFOQXXPMLCG-UHFFFAOYSA-N
Data  1 IC50
  Tab Delimited (TSV)   2D SDfile   Computed 3D by Vconf -m prep SDfile
Find this compound or compounds like it in BindingDB:
Activity Spreadsheet -- Enzyme Inhibition Constant Data from BindingDB
Found 1 hit for monomerid = 50033503
TargetAcetylcholinesterase(Rattus norvegicus (rat))
Hoechst-Roussel Pharmaceuticals
Curated by ChEMBL
LigandPNGBDBM50033503(5-Phenethylamino-5,6,7,8-tetrahydro-1H-quinolin-2-...)
Affinity DataIC50: >1.00E+5nM. Assay description: Acetylcholinesterase inhibitory activity in rat striatal homogenates
In DepthDetails ArticlePubMed