BDBM50033567 CHEMBL408796::Tyr-Ser-Phe-Lys-Gly-Leu-Leu-Leu-Gly-Arg
SMILES CC(C)C[C@H](NC(=O)CNC(=O)[C@H](CCCCN)NC(=O)[C@H](Cc1ccccc1)NC(=O)[C@H](CO)NC(=O)[C@@H](N)Cc1ccc(O)cc1)C(=O)N[C@@H](CC(C)C)C(=O)N[C@@H](CC(C)C)C(=O)NCC(=O)N[C@@H](CCCNC(N)=N)C(O)=O
InChI Key InChIKey=DMHCDRKWXHFBKY-YTAGXALCSA-N
Data  2 EC50
  Tab Delimited (TSV)   2D SDfile   Computed 3D by Vconf -m prep SDfile
Find this compound or compounds like it in BindingDB:
Activity Spreadsheet -- Enzyme Inhibition Constant Data from BindingDB
Found 2 hits for monomerid = 50033567
TargetC5a anaphylatoxin chemotactic receptor 1(Homo sapiens (Human))
University Of Nebraska Medical Center
Curated by ChEMBL
LigandPNGBDBM50033567(CHEMBL408796 | Tyr-Ser-Phe-Lys-Gly-Leu-Leu-Leu-Gly...)
Affinity DataEC50:  2.77E+4nM. Assay description: Release of beta-glucuronidase from human polymorphonuclear leukocytes(PMN)
In DepthDetails ArticlePubMed
TargetC5a anaphylatoxin chemotactic receptor 1(Homo sapiens (Human))
University Of Nebraska Medical Center
Curated by ChEMBL
LigandPNGBDBM50033567(CHEMBL408796 | Tyr-Ser-Phe-Lys-Gly-Leu-Leu-Leu-Gly...)
Affinity DataEC50:  300nM. Assay description: Abilitiy to induce shape change (polarization) in human polymorphonuclear leukocytes (PMN)
In DepthDetails ArticlePubMed