BDBM50033600 Asp-Tyr(SO3H)-Met-Gly-Trp-Met-Asp-Phe-NH2::CHEMBL2111204
SMILES [H][C@@]12C[C@@]3([H])C[C@@]([H])(C1)C(OC(=O)N[C@@](C)(Cc1c[nH]c4ccccc14)C(=O)N[C@@H](CC(O)=O)Cc1ccccc1)[C@@]([H])(C2)C3
InChI Key InChIKey=PGOLWKTUHWHYJS-VFWSZBFSSA-N
Data  2 IC50
  Tab Delimited (TSV)   2D SDfile   Computed 3D by Vconf -m prep SDfile
Find this compound or compounds like it in BindingDB:
Activity Spreadsheet -- Enzyme Inhibition Constant Data from BindingDB
Found 2 hits for monomerid = 50033600
TargetCholecystokinin receptor type A(RAT)
Parke-Davis Neuroscience Research Centre
Curated by ChEMBL
LigandPNGBDBM50033600(Asp-Tyr(SO3H)-Met-Gly-Trp-Met-Asp-Phe-NH2 | CHEMBL...)
Affinity DataIC50:  0.100nM. Assay description: Inhibition of binding of [125I]Bolton-Hunter labeled CCK-8 to cholecystokinin type A receptor in the rat pancreas.
In DepthDetails ArticlePubMed
TargetGastrin/cholecystokinin type B receptor(MOUSE)
Parke-Davis Neuroscience Research Centre
Curated by ChEMBL
LigandPNGBDBM50033600(Asp-Tyr(SO3H)-Met-Gly-Trp-Met-Asp-Phe-NH2 | CHEMBL...)
Affinity DataIC50:  0.300nM. Assay description: Inhibition of binding of [125I]Bolton-Hunter labeled CCK-8 to cholecystokinin type B receptor in the mouse cerebral cortex
In DepthDetails ArticlePubMed