BDBM50033664 CHEMBL7068::{[4-(2-Amino-6-oxo-1,6-dihydro-purin-9-yl)-butyl]-hydroxy-phosphinoylmethyl}-phosphonic acid
SMILES Nc1nc2n(CCCCP(O)(=O)CP(O)(O)=O)cnc2c(=O)[nH]1
InChI Key InChIKey=RVYGISYXHVZBBV-UHFFFAOYSA-N
Data  2 KI
  Tab Delimited (TSV)   2D SDfile   Computed 3D by Vconf -m prep SDfile
Find this compound or compounds like it in BindingDB:
Activity Spreadsheet -- Enzyme Inhibition Constant Data from BindingDB
Found 2 hits for monomerid = 50033664
TargetPurine nucleoside phosphorylase(Homo sapiens (Human))
Burroughs Wellcome
Curated by ChEMBL
LigandPNGBDBM50033664(CHEMBL7068 | {[4-(2-Amino-6-oxo-1,6-dihydro-purin-...)
Affinity DataKi:  100nM. Assay description: Inhibition of human erythrocyte purine nucleoside phosphorylase (PNPase) in the presence of zinc chloride
In DepthDetails ArticlePubMed
TargetPurine nucleoside phosphorylase(Homo sapiens (Human))
Burroughs Wellcome
Curated by ChEMBL
LigandPNGBDBM50033664(CHEMBL7068 | {[4-(2-Amino-6-oxo-1,6-dihydro-purin-...)
Affinity DataKi:  1.40E+3nM. Assay description: Inhibition of human erythrocyte purine nucleoside phosphorylase (PNPase) in the presence of ethylenediaminetetraacetic acid (Na2 EDTA)
In DepthDetails ArticlePubMed