BDBM50034368 CHEMBL28313::Trifluoro-methanesulfonic acid 7-propylamino-5,6,7,8-tetrahydro-naphthalen-1-yl ester
SMILES CCCNC1CCc2cccc(OS(=O)(=O)C(F)(F)F)c2C1
InChI Key InChIKey=ZRWGXXAMGVLDQT-UHFFFAOYSA-N
Data  8 KI
  Tab Delimited (TSV)   2D SDfile   Computed 3D by Vconf -m prep SDfile
Find this compound or compounds like it in BindingDB:
Activity Spreadsheet -- Enzyme Inhibition Constant Data from BindingDB
Found 8 hits for monomerid = 50034368
Target5-hydroxytryptamine receptor 1A(Mus musculus (Mouse))
University Of G£Teborg
Curated by ChEMBL
LigandPNGBDBM50034368(CHEMBL28313 | Trifluoro-methanesulfonic acid 7-pro...)
Affinity DataKi:  2.80nM. Assay description: In vitro binding affinity towards 5-hydroxytryptamine 1A receptor by using [3H]-8-OH-DPAT as radioligand
In DepthDetails ArticlePubMed
Target5-hydroxytryptamine receptor 1A(Rattus norvegicus (rat))
Medicinaregatan
Curated by ChEMBL
LigandPNGBDBM50034368(CHEMBL28313 | Trifluoro-methanesulfonic acid 7-pro...)
Affinity DataKi:  3.80nM. Assay description: Binding affinity against 5-hydroxytryptamine 1A receptor in homogenated rat brain tissue, using by [3H]8-OH-DPAT as radioligand
In DepthDetails ArticlePubMed
Target5-hydroxytryptamine receptor 1D(Homo sapiens (Human))
University Of G£Teborg
Curated by ChEMBL
LigandPNGBDBM50034368(CHEMBL28313 | Trifluoro-methanesulfonic acid 7-pro...)
Affinity DataKi:  15nM. Assay description: In vitro binding affinity towards 5-hydroxytryptamine 1D receptor alpha by using [3H]5-HT as radioligand
In DepthDetails ArticlePubMed
TargetD(2) dopamine receptor(Homo sapiens (Human))
University Of G£Teborg
Curated by ChEMBL
LigandPNGBDBM50034368(CHEMBL28313 | Trifluoro-methanesulfonic acid 7-pro...)
Affinity DataKi:  108nM. Assay description: In vitro binding affinity towards Dopamine receptor D2 by using [3H]U-86170 as radioligand
In DepthDetails ArticlePubMed
Target5-hydroxytryptamine receptor 1D(Homo sapiens (Human))
University Of G£Teborg
Curated by ChEMBL
LigandPNGBDBM50034368(CHEMBL28313 | Trifluoro-methanesulfonic acid 7-pro...)
Affinity DataKi:  169nM. Assay description: In vitro binding affinity towards 5-hydroxytryptamine 1D receptor beta by using [3H]5-HT as radioligand
In DepthDetails ArticlePubMed
TargetD(2) dopamine receptor(Homo sapiens (Human))
University Of G£Teborg
Curated by ChEMBL
LigandPNGBDBM50034368(CHEMBL28313 | Trifluoro-methanesulfonic acid 7-pro...)
Affinity DataKi: >413nM. Assay description: In vitro binding affinity towards Dopamine receptor D2 by using [3H]spiperone as radioligand
In DepthDetails ArticlePubMed
TargetD(3) dopamine receptor(Homo sapiens (Human))
University Of G£Teborg
Curated by ChEMBL
LigandPNGBDBM50034368(CHEMBL28313 | Trifluoro-methanesulfonic acid 7-pro...)
Affinity DataKi:  691nM. Assay description: In vitro binding affinity towards Dopamine receptor D3 by using [3H]spiperone as radioligand
In DepthDetails ArticlePubMed
TargetD(2) dopamine receptor(Rattus norvegicus (rat))
Medicinaregatan
Curated by ChEMBL
LigandPNGBDBM50034368(CHEMBL28313 | Trifluoro-methanesulfonic acid 7-pro...)
Affinity DataKi:  1.36E+3nM. Assay description: Binding affinity against dopamine receptor D2 in rat brain tissue using [3H]spiperone
In DepthDetails ArticlePubMed