BDBM50034443 8-Dimethylamino-naphthalene-2-sulfonic acid (3,4-dimethyl-isoxazol-5-yl)-amide::CHEMBL29705
SMILES CN(C)c1cccc2ccc(cc12)S(=O)(=O)Nc1onc(C)c1C
InChI Key InChIKey=CDAANMFWIWNGIT-UHFFFAOYSA-N
Data  2 IC50
  Tab Delimited (TSV)   2D SDfile   Computed 3D by Vconf -m prep SDfile
Find this compound or compounds like it in BindingDB:
Activity Spreadsheet -- Enzyme Inhibition Constant Data from BindingDB
Found 2 hits for monomerid = 50034443
TargetEndothelin-1 receptor(RAT)
Bristol-Myers Squibb Pharmaceutical Research Institute
Curated by ChEMBL
LigandPNGBDBM50034443(8-Dimethylamino-naphthalene-2-sulfonic acid (3,4-d...)
Affinity DataIC50:  3.15E+4nM. Assay description: Inhibition of [125I]-endothelin-l binding to endothelin A receptor of rat thoracic aorta smooth muscle cells
In DepthDetails ArticlePubMed
TargetEndothelin-1 receptor(RAT)
Bristol-Myers Squibb Pharmaceutical Research Institute
Curated by ChEMBL
LigandPNGBDBM50034443(8-Dimethylamino-naphthalene-2-sulfonic acid (3,4-d...)
Affinity DataIC50:  3.15E+4nM. Assay description: Antagonism of [125 I]ET-1 binding to the rat endothelin receptor in vascular smooth muscle VSM-A10 cells.
In DepthDetails ArticlePubMed