BDBM50034634 CHEMBL3360362
SMILES CC(C)Oc1ccc(cc1Cl)-c1nc(no1)-c1cccc2CCNCCc12
InChI Key InChIKey=FHCSSUVFKCJFPU-UHFFFAOYSA-N
Data  2 EC50
  Tab Delimited (TSV)   2D SDfile   Computed 3D by Vconf -m prep SDfile
Find this compound or compounds like it in BindingDB:
Activity Spreadsheet -- Enzyme Inhibition Constant Data from BindingDB
Found 2 hits for monomerid = 50034634
TargetSphingosine 1-phosphate receptor 1(Homo sapiens (Human))
Glaxosmithkline
Curated by ChEMBL
LigandPNGBDBM50034634(CHEMBL3360362)
Affinity DataEC50:  16nM. Assay description: Agonist activity at human S1P1R expressed in RH7777 membranes assessed as [35S]GTPgammaS binding after 30 mins
In DepthDetails ArticlePubMed
TargetSphingosine 1-phosphate receptor 3(Homo sapiens (Human))
Glaxosmithkline
Curated by ChEMBL
LigandPNGBDBM50034634(CHEMBL3360362)
Affinity DataEC50: <3.16E+4nM. Assay description: Agonist activity at human S1P3R expressed in RBL membranes assessed as [35S]GTPgammaS binding after 30 mins
In DepthDetails ArticlePubMed