BDBM50034937 6-{[Isopropyl-(3,4,5-trimethoxy-phenyl)-amino]-methyl}-5-methyl-pyrido[2,3-d]pyrimidine-2,4-diamine::CHEMBL53693
SMILES COc1cc(cc(OC)c1OC)N(Cc1cnc2nc(N)nc(N)c2c1C)C(C)C
InChI Key InChIKey=VXZIMTKDBAYSKD-UHFFFAOYSA-N
Data  7 IC50
  Tab Delimited (TSV)   2D SDfile   Computed 3D by Vconf -m prep SDfile
Find this compound or compounds like it in BindingDB:
Activity Spreadsheet -- Enzyme Inhibition Constant Data from BindingDB
Found 7 hits for monomerid = 50034937
TargetDihydrofolate reductase(Lactobacillus casei)
Duquesne University
Curated by ChEMBL
LigandPNGBDBM50034937(6-{[Isopropyl-(3,4,5-trimethoxy-phenyl)-amino]-met...)
Affinity DataIC50:  210nM. Assay description: Inhibitory activity against Dihydrofolate reductase from Lactobacillus casei
In DepthDetails ArticlePubMed
TargetBifunctional dihydrofolate reductase-thymidylate synthase(Toxoplasma gondii)
Duquesne University
Curated by ChEMBL
LigandPNGBDBM50034937(6-{[Isopropyl-(3,4,5-trimethoxy-phenyl)-amino]-met...)
Affinity DataIC50:  6.70nM. Assay description: Inhibitory activity against Dihydrofolate reductase from Toxoplasma gondii
In DepthDetails ArticlePubMed
TargetDihydrofolate reductase(Pneumocystis carinii)
Duquesne University
Curated by ChEMBL
LigandPNGBDBM50034937(6-{[Isopropyl-(3,4,5-trimethoxy-phenyl)-amino]-met...)
Affinity DataIC50:  13nM. Assay description: Inhibitory activity against Dihydrofolate reductase from Pneumocystis carinii
In DepthDetails ArticlePubMed
TargetDihydrofolate reductase(Pneumocystis carinii)
Duquesne University
Curated by ChEMBL
LigandPNGBDBM50034937(6-{[Isopropyl-(3,4,5-trimethoxy-phenyl)-amino]-met...)
Affinity DataIC50:  13.4nM. Assay description: Inhibition of Pneumocystis carinii dihydrofolate reductase
In DepthDetails ArticlePubMed
TargetDihydrofolate reductase(Rattus norvegicus (rat))
Duquesne University
Curated by ChEMBL
LigandPNGBDBM50034937(6-{[Isopropyl-(3,4,5-trimethoxy-phenyl)-amino]-met...)
Affinity DataIC50:  17.5nM. Assay description: Inhibition of rat liver dihydrofolate reductase
In DepthDetails ArticlePubMed
TargetBifunctional dihydrofolate reductase-thymidylate synthase(Toxoplasma gondii)
Duquesne University
Curated by ChEMBL
LigandPNGBDBM50034937(6-{[Isopropyl-(3,4,5-trimethoxy-phenyl)-amino]-met...)
Affinity DataIC50:  6.70nM. Assay description: Inhibition of Toxoplasma gondii dihydrofolate reductase
In DepthDetails ArticlePubMed
TargetDihydrofolate reductase(Rattus norvegicus (rat))
Duquesne University
Curated by ChEMBL
LigandPNGBDBM50034937(6-{[Isopropyl-(3,4,5-trimethoxy-phenyl)-amino]-met...)
Affinity DataIC50:  17.5nM. Assay description: Inhibitory activity against Dihydrofolate reductase from rat liver
In DepthDetails ArticlePubMed