BDBM50035058 1-(2,3-Dimethoxy-phenyl)-piperazine::CHEMBL58963
SMILES COc1cccc(N2CCNCC2)c1OC
InChI Key InChIKey=CHCSADXLBWHWOY-UHFFFAOYSA-N
Data  1 KI
  Tab Delimited (TSV)   2D SDfile   Computed 3D by Vconf -m prep SDfile
Find this compound or compounds like it in BindingDB:
Activity Spreadsheet -- Enzyme Inhibition Constant Data from BindingDB
Found 1 hit for monomerid = 50035058
Target5-hydroxytryptamine receptor 1A(Rattus norvegicus (rat))
Solvay Duphar Research Laboratories
Curated by ChEMBL
LigandPNGBDBM50035058(1-(2,3-Dimethoxy-phenyl)-piperazine | CHEMBL58963)
Affinity DataKi:  1.00E+3nM. Assay description: Displacement of [3H]-2-(di-N-propylamino)-8-hydroxytetralin from central 5-hydroxytryptamine 1A receptor recognition sites in rat frontal cortex homo...
In DepthDetails ArticlePubMed