BDBM50035335 (R)-8-Dipropylamino-4-fluoro-6,7,8,9-tetrahydro-3H-benzo[e]indole-1-carbaldehyde::CHEMBL71176
SMILES CCCN(CCC)[C@@H]1CCc2cc(F)c3[nH]cc(C=O)c3c2C1
InChI Key InChIKey=ICOOOYKBBQSJND-OAHLLOKOSA-N
Data  4 KI
  Tab Delimited (TSV)   2D SDfile   Computed 3D by Vconf -m prep SDfile
Find this compound or compounds like it in BindingDB:
Activity Spreadsheet -- Enzyme Inhibition Constant Data from BindingDB
Found 4 hits for monomerid = 50035335
Target5-hydroxytryptamine receptor 1A(Rattus norvegicus (rat))
GöTeborg University
Curated by ChEMBL
LigandPNGBDBM50035335((R)-8-Dipropylamino-4-fluoro-6,7,8,9-tetrahydro-3H...)
Affinity DataKi:  0.300nM. Assay description: Binding affinity against 5-hydroxytryptamine 1A receptor from CHO-K1 cells, using [3H]-8-OH-DPAT as the radioligand.
In DepthDetails ArticlePubMed
Target5-hydroxytryptamine receptor 1D(Homo sapiens (Human))
GöTeborg University
Curated by ChEMBL
LigandPNGBDBM50035335((R)-8-Dipropylamino-4-fluoro-6,7,8,9-tetrahydro-3H...)
Affinity DataKi:  4.40nM. Assay description: Binding affinity against 5-hydroxytryptamine 1D receptor alpha expressed in CHO-K1 cells, using [3H]-5-HT as the radioligand.
In DepthDetails ArticlePubMed
TargetD(2) dopamine receptor(Rattus norvegicus (rat))
GöTeborg University
Curated by ChEMBL
LigandPNGBDBM50035335((R)-8-Dipropylamino-4-fluoro-6,7,8,9-tetrahydro-3H...)
Affinity DataKi:  48nM. Assay description: Binding affinity against Dopamine receptor D2 from CHO-K1 cells, using [3H]-U-86,170 as the radioligand.
In DepthDetails ArticlePubMed
TargetD(3) dopamine receptor(Rattus norvegicus (Rat))
GöTeborg University
Curated by ChEMBL
LigandPNGBDBM50035335((R)-8-Dipropylamino-4-fluoro-6,7,8,9-tetrahydro-3H...)
Affinity DataKi:  55nM. Assay description: Binding affinity against Dopamine receptor D3 from CHO-K1 cells, using [3H]-spiperone as the radioligand.
In DepthDetails ArticlePubMed