BDBM50035347 8-(Allyl-propyl-amino)-6,7,8,9-tetrahydro-3H-benzo[e]indole-1-carbaldehyde::CHEMBL304984
SMILES CCCN(CC=C)C1CCc2ccc3[nH]cc(C=O)c3c2C1
InChI Key InChIKey=DBGOPRYLVZPMHQ-UHFFFAOYSA-N
Data  4 KI
  Tab Delimited (TSV)   2D SDfile   Computed 3D by Vconf -m prep SDfile
Find this compound or compounds like it in BindingDB:
Activity Spreadsheet -- Enzyme Inhibition Constant Data from BindingDB
Found 4 hits for monomerid = 50035347
Target5-hydroxytryptamine receptor 1A(Rattus norvegicus (rat))
Upjohn Laboratories
Curated by ChEMBL
LigandPNGBDBM50035347(8-(Allyl-propyl-amino)-6,7,8,9-tetrahydro-3H-benzo...)
Affinity DataKi:  0.300nM. Assay description: In vitro binding affinity against cloned mammalian 5-hydroxytryptamine 1A receptor expressed in CHO cells, by using [3H]8-OH-DPAT as radioligand.
In DepthDetails ArticlePubMed
Target5-hydroxytryptamine receptor 1B(Homo sapiens (Human))
Upjohn Laboratories
Curated by ChEMBL
LigandPNGBDBM50035347(8-(Allyl-propyl-amino)-6,7,8,9-tetrahydro-3H-benzo...)
Affinity DataKi:  49nM. Assay description: In vitro binding affinity against cloned mammalian 5-hydroxytryptamine 1D receptor beta expressed in CHO cells, by using [3H]5-HT as radioligand
In DepthDetails ArticlePubMed
TargetD(2) dopamine receptor(Rattus norvegicus (rat))
Upjohn Laboratories
Curated by ChEMBL
LigandPNGBDBM50035347(8-(Allyl-propyl-amino)-6,7,8,9-tetrahydro-3H-benzo...)
Affinity DataKi:  59nM. Assay description: In vitro binding affinity against cloned mammalian Dopamine receptor D2 expressed in CHO cells using [3H]U-86170 as radioligand
In DepthDetails ArticlePubMed
TargetD(3) dopamine receptor(Rattus norvegicus (Rat))
Upjohn Laboratories
Curated by ChEMBL
LigandPNGBDBM50035347(8-(Allyl-propyl-amino)-6,7,8,9-tetrahydro-3H-benzo...)
Affinity DataKi:  130nM. Assay description: In vitro binding affinity against cloned mammalian Dopamine receptor D3 expressed in CHO cells by, using [3H]-spiperone as radioligand
In DepthDetails ArticlePubMed