BDBM50035361 (3-Phenyl-propyl)-(6,7,8,9-tetrahydro-3H-benzo[e]indol-8-ylmethyl)-amine::CHEMBL70980
SMILES C(CNCC1CCc2ccc3[nH]ccc3c2C1)Cc1ccccc1
InChI Key InChIKey=ZBSUSNSHVMDYGJ-UHFFFAOYSA-N
Data  5 KI
  Tab Delimited (TSV)   2D SDfile   Computed 3D by Vconf -m prep SDfile
Find this compound or compounds like it in BindingDB:
Activity Spreadsheet -- Enzyme Inhibition Constant Data from BindingDB
Found 5 hits for monomerid = 50035361
Target5-hydroxytryptamine receptor 1A(Rattus norvegicus (rat))
Upjohn Laboratories
Curated by ChEMBL
LigandPNGBDBM50035361((3-Phenyl-propyl)-(6,7,8,9-tetrahydro-3H-benzo[e]i...)
Affinity DataKi:  3.40nM. Assay description: In vitro binding affinity against cloned mammalian 5-hydroxytryptamine 1A receptor expressed in CHO cells, by using [3H]8-OH-DPAT as radioligand.
In DepthDetails ArticlePubMed
TargetD(2) dopamine receptor(Rattus norvegicus (rat))
Upjohn Laboratories
Curated by ChEMBL
LigandPNGBDBM50035361((3-Phenyl-propyl)-(6,7,8,9-tetrahydro-3H-benzo[e]i...)
Affinity DataKi:  32nM. Assay description: Binding affinity rat Dopamine receptor D2 expressed in CHO-K1 cells by [3H]U-86170 displacement.
In DepthDetails ArticlePubMed
Target5-hydroxytryptamine receptor 1D(Homo sapiens (Human))
Upjohn Laboratories
Curated by ChEMBL
LigandPNGBDBM50035361((3-Phenyl-propyl)-(6,7,8,9-tetrahydro-3H-benzo[e]i...)
Affinity DataKi:  63nM. Assay description: In vitro binding affinity against cloned mammalian 5-hydroxytryptamine 1D receptor alpha expressed in CHO cells, by using [3H]5-HT as radioligand
In DepthDetails ArticlePubMed
TargetD(3) dopamine receptor(Rattus norvegicus (Rat))
Upjohn Laboratories
Curated by ChEMBL
LigandPNGBDBM50035361((3-Phenyl-propyl)-(6,7,8,9-tetrahydro-3H-benzo[e]i...)
Affinity DataKi:  199nM. Assay description: In vitro binding affinity against cloned mammalian Dopamine receptor D3 expressed in CHO cells by, using [3H]-spiperone as radioligand
In DepthDetails ArticlePubMed
Target5-hydroxytryptamine receptor 1B(Homo sapiens (Human))
Upjohn Laboratories
Curated by ChEMBL
LigandPNGBDBM50035361((3-Phenyl-propyl)-(6,7,8,9-tetrahydro-3H-benzo[e]i...)
Affinity DataKi:  228nM. Assay description: In vitro binding affinity against cloned mammalian 5-hydroxytryptamine 1D receptor beta expressed in CHO cells, by using [3H]5-HT as radioligand
In DepthDetails ArticlePubMed