BDBM50036396 CHEMBL163320::N-[3,5-Dibromo-4-(4-hydroxy-3-isopropyl-phenoxy)-phenyl]-oxalamic acid
SMILES CC(C)c1cc(Oc2c(Br)cc(NC(=O)C(O)=O)cc2Br)ccc1O
InChI Key InChIKey=FZSDMGJUDNAFJB-UHFFFAOYSA-N
Data  2 IC50
  Tab Delimited (TSV)   2D SDfile   Computed 3D by Vconf -m prep SDfile
Find this compound or compounds like it in BindingDB:
Activity Spreadsheet -- Enzyme Inhibition Constant Data from BindingDB
Found 2 hits for monomerid = 50036396
TargetThyroid hormone receptor beta(RAT)
Ciba Pharmaceuticals
Curated by ChEMBL
LigandPNGBDBM50036396(CHEMBL163320 | N-[3,5-Dibromo-4-(4-hydroxy-3-isopr...)
Affinity DataIC50:  6nM. Assay description: In vitro inhibition of the bound [125I]L-T3 rat liver nuclear L-triiodothyronine receptor
In DepthDetails ArticlePubMed
TargetThyroid hormone receptor beta(RAT)
Ciba Pharmaceuticals
Curated by ChEMBL
LigandPNGBDBM50036396(CHEMBL163320 | N-[3,5-Dibromo-4-(4-hydroxy-3-isopr...)
Affinity DataIC50:  4.00E+3nM. Assay description: In vitro inhibition of bound [125I]L-T3 rat plasma membrane 3,5,3'' L-triiodothyronine receptor
In DepthDetails ArticlePubMed