BDBM50036432 CHEMBL264041::N-[4-(3-Isopropyl-phenoxy)-3,5-dimethyl-phenyl]-oxalamic acid methyl ester
SMILES COC(=O)C(=O)Nc1cc(C)c(Oc2cccc(c2)C(C)C)c(C)c1
InChI Key InChIKey=ABNYOHVDUONPRS-UHFFFAOYSA-N
Data  1 IC50
  Tab Delimited (TSV)   2D SDfile   Computed 3D by Vconf -m prep SDfile
Find this compound or compounds like it in BindingDB:
Activity Spreadsheet -- Enzyme Inhibition Constant Data from BindingDB
Found 1 hit for monomerid = 50036432
TargetThyroid hormone receptor beta(RAT)
Ciba Pharmaceuticals
Curated by ChEMBL
LigandPNGBDBM50036432(CHEMBL264041 | N-[4-(3-Isopropyl-phenoxy)-3,5-dime...)
Affinity DataIC50:  8nM. Assay description: In vitro inhibition of the bound [125I]L-T3 rat liver nuclear L-triiodothyronine receptor
In DepthDetails ArticlePubMed