BDBM50036452 1-((3aR,9bS)-3-Propyl-2,3,3a,4,5,9b-hexahydro-1H-benzo[e]indol-9-yl)-ethanone::CHEMBL351234
SMILES CCCN1CC[C@@H]2[C@H]1CCc1cccc(C(C)=O)c21
InChI Key InChIKey=PMSNWAIFNUHOQD-HZPDHXFCSA-N
Data  2 KI
  Tab Delimited (TSV)   2D SDfile   Computed 3D by Vconf -m prep SDfile
Find this compound or compounds like it in BindingDB:
Activity Spreadsheet -- Enzyme Inhibition Constant Data from BindingDB
Found 2 hits for monomerid = 50036452
Target5-hydroxytryptamine receptor 1A(Rattus norvegicus (rat))
Upjohn Laboratories
Curated by ChEMBL
LigandPNGBDBM50036452(1-((3aR,9bS)-3-Propyl-2,3,3a,4,5,9b-hexahydro-1H-b...)
Affinity DataKi:  0.400nM. Assay description: In vitro displacement of radioactively labeled ligand [3H]-8-OH-DPAT from 5-hydroxytryptamine 1A receptor site in CHO cells
In DepthDetails ArticlePubMed
TargetD(2) dopamine receptor(Rattus norvegicus (rat))
Upjohn Laboratories
Curated by ChEMBL
LigandPNGBDBM50036452(1-((3aR,9bS)-3-Propyl-2,3,3a,4,5,9b-hexahydro-1H-b...)
Affinity DataKi:  91nM. Assay description: Displacement of [3H]-U-86,170 from Dopamine receptor D2
In DepthDetails ArticlePubMed