BDBM50036927 2-[4-(4-Benzo[d]isothiazol-3-yl-piperazin-1-yl)-butyl]-2,3,4,5-tetrahydro-benzo[c]azepin-1-one::CHEMBL315925
SMILES O=C1N(CCCCN2CCN(CC2)c2nsc3ccccc23)CCCc2ccccc12
InChI Key InChIKey=XITOBPDXYLJVKL-UHFFFAOYSA-N
Data  2 IC50
  Tab Delimited (TSV)   2D SDfile   Computed 3D by Vconf -m prep SDfile
Find this compound or compounds like it in BindingDB:
Activity Spreadsheet -- Enzyme Inhibition Constant Data from BindingDB
Found 2 hits for monomerid = 50036927
Target5-hydroxytryptamine receptor 1A(Rattus norvegicus (rat))
Burroughs Wellcome
Curated by ChEMBL
LigandPNGBDBM50036927(2-[4-(4-Benzo[d]isothiazol-3-yl-piperazin-1-yl)-bu...)
Affinity DataIC50:  4.10nM. Assay description: In vitro binding affinity was measured on serotonergic 5-hydroxytryptamine 1A receptor by displacement of [3H]- tetralin
In DepthDetails ArticlePubMed
TargetD(2) dopamine receptor(Rattus norvegicus (rat))
Burroughs Wellcome
Curated by ChEMBL
LigandPNGBDBM50036927(2-[4-(4-Benzo[d]isothiazol-3-yl-piperazin-1-yl)-bu...)
Affinity DataIC50:  5.20nM. Assay description: In vitro binding affinity was measured by displacement of [3H]- raclopride from D2 receptor isolated from the striata of male Dawley rats
In DepthDetails ArticlePubMed