BDBM50036929 2-[4-(4-Benzo[d]isothiazol-3-yl-piperazin-1-yl)-butyl]-2H-phthalazin-1-one::CHEMBL85647
SMILES O=c1n(CCCCN2CCN(CC2)c2nsc3ccccc23)ncc2ccccc12
InChI Key InChIKey=UMDBFJMJDROUKJ-UHFFFAOYSA-N
Data  2 IC50
  Tab Delimited (TSV)   2D SDfile   Computed 3D by Vconf -m prep SDfile
Find this compound or compounds like it in BindingDB:
Activity Spreadsheet -- Enzyme Inhibition Constant Data from BindingDB
Found 2 hits for monomerid = 50036929
Target5-hydroxytryptamine receptor 1A(Rattus norvegicus (rat))
Burroughs Wellcome
Curated by ChEMBL
LigandPNGBDBM50036929(2-[4-(4-Benzo[d]isothiazol-3-yl-piperazin-1-yl)-bu...)
Affinity DataIC50:  10nM. Assay description: In vitro binding affinity was measured on serotonergic 5-hydroxytryptamine 1A receptor by displacement of [3H]- tetralin
In DepthDetails ArticlePubMed
TargetD(2) dopamine receptor(Rattus norvegicus (rat))
Burroughs Wellcome
Curated by ChEMBL
LigandPNGBDBM50036929(2-[4-(4-Benzo[d]isothiazol-3-yl-piperazin-1-yl)-bu...)
Affinity DataIC50:  32nM. Assay description: In vitro binding affinity was measured by displacement of [3H]- raclopride from D2 receptor isolated from the striata of male Dawley rats
In DepthDetails ArticlePubMed