BDBM50037096 CHEMBL105067::N-{2-Oxo-1-[(3,3,3-trifluoro-1-isopropyl-2-oxo-propylcarbamoyl)-methyl]-1,2-dihydro-pyridin-3-yl}-oxalamic acid methyl ester
SMILES COC(=O)C(=O)Nc1cccn(CC(=O)NC(C(C)C)C(=O)C(F)(F)F)c1=O
InChI Key InChIKey=MHQJGFJLLATLJP-UHFFFAOYSA-N
Data  1 KI
  Tab Delimited (TSV)   2D SDfile   Computed 3D by Vconf -m prep SDfile
Find this compound or compounds like it in BindingDB:
Activity Spreadsheet -- Enzyme Inhibition Constant Data from BindingDB
Found 1 hit for monomerid = 50037096
TargetNeutrophil elastase(Homo sapiens (Human))
Zeneca
Curated by ChEMBL
LigandPNGBDBM50037096(CHEMBL105067 | N-{2-Oxo-1-[(3,3,3-trifluoro-1-isop...)
Affinity DataKi:  500nM. Assay description: The compound was tested in vitro for ability to inhibit human leukocyte elastase activity
In DepthDetails ArticlePubMed