BDBM50037102 CHEMBL75936::{2-Oxo-5-[3-(2,2,2-trifluoro-acetylamino)-benzyl]-1-[(3,3,3-trifluoro-1-isopropyl-2-oxo-propylcarbamoyl)-methyl]-1,2-dihydro-pyridin-3-yl}-carbamic acid benzyl ester
SMILES CC(C)C(NC(=O)Cn1cc(Cc2cccc(NC(=O)C(F)(F)F)c2)cc(NC(=O)OCc2ccccc2)c1=O)C(=O)C(F)(F)F
InChI Key InChIKey=VYNFCOWRNSUDCE-UHFFFAOYSA-N
Data  1 KI
  Tab Delimited (TSV)   2D SDfile   Computed 3D by Vconf -m prep SDfile
Find this compound or compounds like it in BindingDB:
Activity Spreadsheet -- Enzyme Inhibition Constant Data from BindingDB
Found 1 hit for monomerid = 50037102
TargetNeutrophil elastase(Homo sapiens (Human))
Zeneca
Curated by ChEMBL
LigandPNGBDBM50037102(CHEMBL75936 | {2-Oxo-5-[3-(2,2,2-trifluoro-acetyla...)
Affinity DataKi:  36nM. Assay description: The compound was tested in vitro for ability to inhibit human leukocyte elastase activity
In DepthDetails ArticlePubMed