BDBM50037162 2-[5-(Benzyl-methyl-amino)-pentyl]-5-nitro-isoindole-1,3-dione::CHEMBL104005
SMILES CN(CCCCCN1C(=O)c2ccc(cc2C1=O)[N+]([O-])=O)Cc1ccccc1
InChI Key InChIKey=VWMFXKKXPQTVJN-UHFFFAOYSA-N
Data  1 IC50
  Tab Delimited (TSV)   2D SDfile   Computed 3D by Vconf -m prep SDfile
Find this compound or compounds like it in BindingDB:
Activity Spreadsheet -- Enzyme Inhibition Constant Data from BindingDB
Found 1 hit for monomerid = 50037162
TargetAcetylcholinesterase(Rattus norvegicus (rat))
Takeda Chemical Industries
Curated by ChEMBL
LigandPNGBDBM50037162(2-[5-(Benzyl-methyl-amino)-pentyl]-5-nitro-isoindo...)
Affinity DataIC50:  1.36E+3nM. Assay description: Inhibition concentration against rat acetylcholinesterase
In DepthDetails ArticlePubMed