BDBM50037171 3-(1-Benzyl-piperidin-4-yl)-1-(1-methyl-2,3-dihydro-1H-indol-5-yl)-propan-1-one::3-(1-benzylpiperidin-4-yl)-1-(1-methylindolin-5-yl)propan-1-one::CHEMBL311017
SMILES CN1CCc2cc(ccc12)C(=O)CCC1CCN(Cc2ccccc2)CC1
InChI Key InChIKey=VUEKQQFQMBNDTO-UHFFFAOYSA-N
Data  3 IC50
  Tab Delimited (TSV)   2D SDfile   Computed 3D by Vconf -m prep SDfile
Find this compound or compounds like it in BindingDB:
Activity Spreadsheet -- Enzyme Inhibition Constant Data from BindingDB
Found 3 hits for monomerid = 50037171
TargetAcetylcholinesterase(Rattus norvegicus (rat))
Takeda Chemical Industries
Curated by ChEMBL
LigandPNGBDBM50037171(3-(1-Benzyl-piperidin-4-yl)-1-(1-methyl-2,3-dihydr...)
Affinity DataIC50:  10nM. Assay description: Inhibition concentration against rat acetylcholinesterase
In DepthDetails ArticlePubMed
TargetAcetylcholinesterase(Homo sapiens (Human))
Sichuan University
Curated by ChEMBL
LigandPNGBDBM50037171(3-(1-Benzyl-piperidin-4-yl)-1-(1-methyl-2,3-dihydr...)
Affinity DataIC50:  10nM. Assay description: Inhibition of AChE
In DepthDetails ArticlePubMed
TargetAcetylcholinesterase(Rattus norvegicus (rat))
Takeda Chemical Industries
Curated by ChEMBL
LigandPNGBDBM50037171(3-(1-Benzyl-piperidin-4-yl)-1-(1-methyl-2,3-dihydr...)
Affinity DataIC50:  10nM. Assay description: Inhibition of acetylcholinesterase (AChE)
In DepthDetails ArticlePubMed