BDBM50037183 3-(1-Benzyl-piperidin-4-yl)-1-(1-ethyl-2,3,4,5-tetrahydro-1H-benzo[b]azepin-8-yl)-propan-1-one::3-(1-benzylpiperidin-4-yl)-1-(1-ethyl-2,3,4,5-tetrahydro-1H-benzo[b]azepin-8-yl)propan-1-one::CHEMBL310467
SMILES CCN1CCCCc2ccc(cc12)C(=O)CCC1CCN(Cc2ccccc2)CC1
InChI Key InChIKey=NYVKEUVLHDSEJG-UHFFFAOYSA-N
Data  3 IC50
  Tab Delimited (TSV)   2D SDfile   Computed 3D by Vconf -m prep SDfile
Find this compound or compounds like it in BindingDB:
Activity Spreadsheet -- Enzyme Inhibition Constant Data from BindingDB
Found 3 hits for monomerid = 50037183
TargetAcetylcholinesterase(Rattus norvegicus (rat))
Takeda Chemical Industries
Curated by ChEMBL
LigandPNGBDBM50037183(3-(1-Benzyl-piperidin-4-yl)-1-(1-ethyl-2,3,4,5-tet...)
Affinity DataIC50:  376nM. Assay description: Inhibition concentration against rat acetylcholinesterase
In DepthDetails ArticlePubMed
TargetAcetylcholinesterase(Homo sapiens (Human))
Sichuan University
Curated by ChEMBL
LigandPNGBDBM50037183(3-(1-Benzyl-piperidin-4-yl)-1-(1-ethyl-2,3,4,5-tet...)
Affinity DataIC50:  376nM. Assay description: Inhibition of AChE
In DepthDetails ArticlePubMed
TargetAcetylcholinesterase(Rattus norvegicus (rat))
Takeda Chemical Industries
Curated by ChEMBL
LigandPNGBDBM50037183(3-(1-Benzyl-piperidin-4-yl)-1-(1-ethyl-2,3,4,5-tet...)
Affinity DataIC50:  376nM. Assay description: Inhibition of acetylcholinesterase (AChE)
In DepthDetails ArticlePubMed