BDBM50037234 1H-Indole-2-carboxylic acid [2-(7-methoxy-naphthalen-1-yl)-ethyl]-amide::CHEMBL37341
SMILES COc1ccc2cccc(CCNC(=O)c3cc4ccccc4[nH]3)c2c1
InChI Key InChIKey=VRWWBTBOWUNVQD-UHFFFAOYSA-N
Data  2 IC50  1 Kd
  Tab Delimited (TSV)   2D SDfile   Computed 3D by Vconf -m prep SDfile
Find this compound or compounds like it in BindingDB:
Activity Spreadsheet -- Enzyme Inhibition Constant Data from BindingDB
Found 3 hits for monomerid = 50037234
TargetMelatonin receptor type 1A(Homo sapiens (Human))
Universit£
Curated by ChEMBL
LigandPNGBDBM50037234(1H-Indole-2-carboxylic acid [2-(7-methoxy-naphthal...)
Affinity DataIC50:  2.51E+3nM. Assay description: Melatonin receptor type 1A binding affinity measured using 2-[125I]iodomelatonin on ovine pars tuberalis membrane homogenates.
In DepthDetails ArticlePubMed
TargetMelatonin receptor type 1A/1B(Homo sapiens (Human))
Institut De Chimie Pharmaceutique
Curated by ChEMBL
LigandPNGBDBM50037234(1H-Indole-2-carboxylic acid [2-(7-methoxy-naphthal...)
Affinity DataIC50:  2.69E+3nM. Assay description: Monophasic inhibitory concentration against melatonin receptor was measured on ovine pars tuberalis membrane.
In DepthDetails ArticlePubMed
TargetMelatonin receptor type 1A/1B(Homo sapiens (Human))
Institut De Chimie Pharmaceutique
Curated by ChEMBL
LigandPNGBDBM50037234(1H-Indole-2-carboxylic acid [2-(7-methoxy-naphthal...)
Affinity DataKd:  1.20E+3nM. Assay description: Binding affinity to melatonin receptor measured on ovine pars tuberalis membrane
In DepthDetails ArticlePubMed