BDBM50037241 CHEMBL34348::N-(2-(7-methoxynaphthalen-1-yl)ethyl)benzamide::N-[2-(7-Methoxy-naphthalen-1-yl)-ethyl]-benzamide
SMILES COc1ccc2cccc(CCNC(=O)c3ccccc3)c2c1
InChI Key InChIKey=DIYJECSEAUYTCQ-UHFFFAOYSA-N
Data  2 IC50  1 Kd
  Tab Delimited (TSV)   2D SDfile   Computed 3D by Vconf -m prep SDfile
Find this compound or compounds like it in BindingDB:
Activity Spreadsheet -- Enzyme Inhibition Constant Data from BindingDB
Found 3 hits for monomerid = 50037241
TargetRibosyldihydronicotinamide dehydrogenase [quinone](Homo sapiens (Human))
Lanzhou University
Curated by ChEMBL
LigandPNGBDBM50037241(CHEMBL34348 | N-(2-(7-methoxynaphthalen-1-yl)ethyl...)
Affinity DataIC50:  28.8nM. Assay description: Displacement of [125I]iodomelatonin from MT3/QR2 melatonin binding site expressed in CHO cells
In DepthDetails ArticlePubMed
TargetMelatonin receptor type 1A/1B(Homo sapiens (Human))
Institut De Chimie Pharmaceutique
Curated by ChEMBL
LigandPNGBDBM50037241(CHEMBL34348 | N-(2-(7-methoxynaphthalen-1-yl)ethyl...)
Affinity DataIC50:  2.51E+3nM. Assay description: Monophasic inhibitory concentration against melatonin receptor was measured on ovine pars tuberalis membrane.
In DepthDetails ArticlePubMed
TargetMelatonin receptor type 1A/1B(Homo sapiens (Human))
Institut De Chimie Pharmaceutique
Curated by ChEMBL
LigandPNGBDBM50037241(CHEMBL34348 | N-(2-(7-methoxynaphthalen-1-yl)ethyl...)
Affinity DataKd:  5.00E+3nM. Assay description: Binding affinity to melatonin receptor measured on ovine pars tuberalis membrane
In DepthDetails ArticlePubMed