BDBM50037302 (R)-2-((R)-4-Carboxy-4-{4-[(2-methyl-4-oxo-3,4-dihydro-quinazolin-6-ylmethyl)-prop-2-ynyl-amino]-benzoylamino}-butyrylamino)-pentanoic acid::CHEMBL320530
SMILES CCC[C@@H](NC(=O)CC[C@@H](NC(=O)c1ccc(cc1)N(CC#C)Cc1ccc2nc(C)[nH]c(=O)c2c1)C(O)=O)C(O)=O
InChI Key InChIKey=NMFSAWRHVAFOCB-JWQCQUIFSA-N
Data  1 IC50
  Tab Delimited (TSV)   2D SDfile   Computed 3D by Vconf -m prep SDfile
Find this compound or compounds like it in BindingDB:
Activity Spreadsheet -- Enzyme Inhibition Constant Data from BindingDB
Found 1 hit for monomerid = 50037302
TargetThymidylate synthase(Mus musculus)
Institute Of Cancer Research
Curated by ChEMBL
LigandPNGBDBM50037302((R)-2-((R)-4-Carboxy-4-{4-[(2-methyl-4-oxo-3,4-dih...)
Affinity DataIC50:  16nM. Assay description: Tested for inhibition against thymidylate synthase(TS) which is partially purified from L1210 mouse leukemia cells
In DepthDetails ArticlePubMed