BDBM50037307 (R)-4-((R)-1-Carboxy-ethylcarbamoyl)-2-{4-[(2-methyl-4-oxo-3,4-dihydro-quinazolin-6-ylmethyl)-prop-2-ynyl-amino]-benzoylamino}-butyric acid::CHEMBL322747
SMILES C[C@@H](NC(=O)CC[C@@H](NC(=O)c1ccc(cc1)N(CC#C)Cc1ccc2nc(C)[nH]c(=O)c2c1)C(O)=O)C(O)=O
InChI Key InChIKey=KWTPVLRPVDASNH-WAIKUNEKSA-N
Data  1 IC50
  Tab Delimited (TSV)   2D SDfile   Computed 3D by Vconf -m prep SDfile
Find this compound or compounds like it in BindingDB:
Activity Spreadsheet -- Enzyme Inhibition Constant Data from BindingDB
Found 1 hit for monomerid = 50037307
TargetThymidylate synthase(Mus musculus)
Institute Of Cancer Research
Curated by ChEMBL
LigandPNGBDBM50037307((R)-4-((R)-1-Carboxy-ethylcarbamoyl)-2-{4-[(2-meth...)
Affinity DataIC50:  18nM. Assay description: Tested for inhibition against thymidylate synthase(TS) which is partially purified from L1210 mouse leukemia cells
In DepthDetails ArticlePubMed