BDBM50037340 CHEMBL112880::{6-(3,5-Dimethoxy-phenyl)-2-oxo-1-[(3,3,3-trifluoro-1-isopropyl-2-oxo-propylcarbamoyl)-methyl]-1,2-dihydro-pyridin-3-yl}-carbamic acid benzyl ester
SMILES COc1cc(OC)cc(c1)-c1ccc(NC(=O)OCc2ccccc2)c(=O)n1CC(=O)NC(C(C)C)C(=O)C(F)(F)F
InChI Key InChIKey=XQDJSTTYDXNWJG-UHFFFAOYSA-N
Data  1 KI
  Tab Delimited (TSV)   2D SDfile   Computed 3D by Vconf -m prep SDfile
Find this compound or compounds like it in BindingDB:
Activity Spreadsheet -- Enzyme Inhibition Constant Data from BindingDB
Found 1 hit for monomerid = 50037340
TargetNeutrophil elastase(Homo sapiens (Human))
Zeneca Pharmaceuticals Group
Curated by ChEMBL
LigandPNGBDBM50037340(CHEMBL112880 | {6-(3,5-Dimethoxy-phenyl)-2-oxo-1-[...)
Affinity DataKi:  3.80nM. Assay description: Tested for inhibitory activity against human leukocyte elastase(HLE) enzyme
In DepthDetails ArticlePubMed