BDBM50037497 CHEMBL3356704
SMILES COc1cc(Oc2ccc(cc2)[C@H](NC(=O)OC(C)(C)C)C(=O)Nc2ccccc2C(=O)NS(=O)(=O)CCCC=C)nc(n1)-c1ccccc1
InChI Key InChIKey=BJHYKAIRMZXQJV-HKBQPEDESA-N
Data  1 KI
  Tab Delimited (TSV)   2D SDfile   Computed 3D by Vconf -m prep SDfile
Find this compound or compounds like it in BindingDB:
Activity Spreadsheet -- Enzyme Inhibition Constant Data from BindingDB
Found 1 hit for monomerid = 50037497
TargetGenome polyprotein(Hepatitis C virus)
TBA
Curated by ChEMBL
LigandPNGBDBM50037497(CHEMBL3356704)
Affinity DataKi:  600nM. Assay description: Inhibition of HCV genotype 1a NS3/4A protease using Ac-DED(Edans)EEAbu-psi[COO]ASK(Dabcyl)-NH2 as substrate by FRET assay
In DepthDetails ArticlePubMed