BDBM50037559 (S)-2-[((S)-1-{(S)-2-[(S)-2-((S)-2-Amino-4-methyl-pentanoylamino)-3-phenyl-propionylamino]-4-carbamoyl-butyryl}-pyrrolidine-2-carbonyl)-amino]-pentanedioic acid 5-amide 1-{[(S)-1-((S)-1-carbamoyl-2-phenyl-ethylcarbamoyl)-4-guanidino-butyl]-amide}::CHEMBL420318
SMILES CC(C)C[C@H](N)C(=O)N[C@@H](Cc1ccccc1)C(=O)N[C@@H](CCC(N)=O)C(=O)N1CCC[C@H]1C(=O)N[C@@H](CCC(N)=O)C(=O)N[C@@H](CCCNC(N)=N)C(=O)N[C@@H](Cc1ccccc1)C(N)=O
InChI Key InChIKey=MNRITTZGGLPDBP-POFDKVPJSA-N
Data  1 KI
  Tab Delimited (TSV)   2D SDfile   Computed 3D by Vconf -m prep SDfile
Find this compound or compounds like it in BindingDB:
Activity Spreadsheet -- Enzyme Inhibition Constant Data from BindingDB
Found 1 hit for monomerid = 50037559
TargetNeuropeptide FF receptor 2(RAT)
Cnrs
Curated by ChEMBL
LigandPNGBDBM50037559((S)-2-[((S)-1-{(S)-2-[(S)-2-((S)-2-Amino-4-methyl-...)
Affinity DataKi:  0.200nM. Assay description: Binding affinity for NPPF receptor in rat spinal cord membranes using the radioligand [125I]-[Tyr1]NPFF
In DepthDetails ArticlePubMed