BDBM50037566 (S)-2-{[(R)-1-((S)-2-Amino-4-carbamoyl-butyryl)-pyrrolidine-2-carbonyl]-amino}-pentanedioic acid 5-amide 1-{[(S)-1-((S)-1-carbamoyl-2-phenyl-ethylcarbamoyl)-4-guanidino-butyl]-amide}::CHEMBL117975
SMILES N[C@@H](CCC(N)=O)C(=O)N1CCC[C@@H]1C(=O)N[C@@H](CCC(N)=O)C(=O)N[C@@H](CCCNC(N)=N)C(=O)N[C@@H](Cc1ccccc1)C(N)=O
InChI Key InChIKey=NIPZTEUMXAUJAG-KNOXWWKRSA-N
Data  1 KI
  Tab Delimited (TSV)   2D SDfile   Computed 3D by Vconf -m prep SDfile
Find this compound or compounds like it in BindingDB:
Activity Spreadsheet -- Enzyme Inhibition Constant Data from BindingDB
Found 1 hit for monomerid = 50037566
TargetNeuropeptide FF receptor 2(RAT)
Cnrs
Curated by ChEMBL
LigandPNGBDBM50037566((S)-2-{[(R)-1-((S)-2-Amino-4-carbamoyl-butyryl)-py...)
Affinity DataKi:  64nM. Assay description: Binding affinity for NPPF receptor in rat spinal cord membranes using the radioligand [125I]-[Tyr1]NPFF
In DepthDetails ArticlePubMed